Target
Substance-K receptor
Ligand
BDBM50108284
Substrate
Meas. Tech.
ChEBML_209195
Ki
22±n/a nM
Citation
 Shih, NYAlbanese, MAnthes, JCCarruthers, NIGrice, CALin, LMangiaracina, PReichard, GASchwerdt, JSeidl, VWong, SCPiwinski, JJ Synthesis and structure-activity relationships of oxime neurokinin antagonists: discovery of potent arylamides. Bioorg Med Chem Lett 12:141-5 (2001)  
Target
Name:
Substance-K receptor
Synonyms:
NK-2 receptor NK2R NKNAR Neurokinin A receptor Neurokinin-2 (NK-2) SKR TACR2 Tachykinin receptor 2 (NK2) | hnk-3
Type:
Protein
Mol. Mass.:
44455.78
Organism:
Homo sapiens (Human)
Description:
P21452
Residue:
398
  
Inhibitor
Name:
BDBM50108284
Synonyms:
1-[(3,5-Bis-trifluoromethyl-benzyl)-methyl-amino]-3-(3,4-dichloro-phenyl)-5-(4-hydroxy-4-phenyl-piperidin-1-yl)-pentan-2-one O-methyl-oxime | CHEMBL287523
Type:
Small organic molecule
Emp. Form.:
C33H35Cl2F6N3O2
Mol. Mass.:
690.546
SMILES:
CO\N=C(/CN(C)Cc1cc(cc(c1)C(F)(F)F)C(F)(F)F)C(CCN1CCC(O)(CC1)c1ccccc1)c1ccc(Cl)c(Cl)c1
: