Target
Mitogen-activated protein kinase kinase kinase 9
Ligand
BDBM50108292
Substrate
Meas. Tech.
ChEBML_122391
IC50
90±n/a nM
Citation
 Murakata, CKaneko, MGessner, GAngeles, TSAtor, MAO'Kane, TMMcKenna, BAThomas, BAMathiasen, JRSaporito, MSBozyczko-Coyne, DHudkins, RL Mixed lineage kinase activity of indolocarbazole analogues. Bioorg Med Chem Lett 12:147-50 (2001)  
Target
Name:
Mitogen-activated protein kinase kinase kinase 9
Synonyms:
M3K9_HUMAN MLK1 Mitogen-activated protein kinase kinase kinase 9 (MLK1) PRKE1
Type:
protein
Mol. Mass.:
121881.51
Organism:
Homo sapiens (Human)
Description:
P80192
Residue:
1104
  
Inhibitor
Name:
BDBM50108292
Synonyms:
CHEMBL37529 | Indolocarbazole analogue
Type:
Small organic molecule
Emp. Form.:
C35H37N3O5S2
Mol. Mass.:
643.815
SMILES:
CCCSCc1ccc2n3[C@H]4C[C@](O)(C(=O)OC)[C@](C)(O4)n4c5ccc(CSCCC)cc5c5c6CNC(=O)c6c(c2c1)c3c45
: