Target
Protein kinase C alpha/beta/delta/epsilon/eta/gamma/theta/zeta type
Ligand
BDBM50108293
Substrate
Meas. Tech.
ChEMBL_162380 (CHEMBL767468)
IC50
2600±n/a nM
Citation
 Murakata, CKaneko, MGessner, GAngeles, TSAtor, MAO'Kane, TMMcKenna, BAThomas, BAMathiasen, JRSaporito, MSBozyczko-Coyne, DHudkins, RL Mixed lineage kinase activity of indolocarbazole analogues. Bioorg Med Chem Lett 12:147-50 (2001)  
Target
Name:
Protein kinase C alpha/beta/delta/epsilon/eta/gamma/theta/zeta type
Synonyms:
Protein kinase C (PKC)
Type:
Mol. Mass.:
Description:
ASSAY_ID of ChEMBL is 162388
Components:
This complex has 8 components.
Component 1
Name:
Protein kinase C delta type
Synonyms:
KPCD_RAT Prkcd Protein kinase C delta type catalytic subunit SDK1 nPKC-delta
Type:
PROTEIN
Mol. Mass.:
77531.57
Organism:
Rattus norvegicus
Description:
ChEMBL_104731
Residue:
673
  
Component 2
Name:
Protein kinase C eta type
Synonyms:
KPCL_RAT Pkch Protein kinase C eta type | nPKC-eta
Type:
PROTEIN
Mol. Mass.:
77961.39
Organism:
Rattus norvegicus
Description:
ChEMBL_104731
Residue:
683
  
Component 3
Name:
Protein kinase C theta type
Synonyms:
KPCT_RAT Prkcq nPKC-theta
Type:
PROTEIN
Mol. Mass.:
81765.17
Organism:
Rattus norvegicus
Description:
ChEMBL_104731
Residue:
707
  
Component 4
Name:
Protein kinase C alpha type
Synonyms:
KPCA_RAT Prkca Protein kinase C alpha | Protein kinase C alpha type
Type:
Protein
Mol. Mass.:
76797.67
Organism:
Rattus norvegicus (Rat)
Description:
P05696
Residue:
672
  
Component 5
Name:
Protein kinase C gamma type
Synonyms:
KPCG_RAT Pkcg Prkcg Protein kinase C gamma
Type:
PROTEIN
Mol. Mass.:
78367.88
Organism:
Rattus norvegicus
Description:
ChEMBL_152979
Residue:
697
  
Component 6
Name:
Protein kinase C zeta type
Synonyms:
KPCZ_RAT Prkcz Protein kinase C zeta type | nPKC-zeta
Type:
PROTEIN
Mol. Mass.:
67722.31
Organism:
Rattus norvegicus
Description:
ChEMBL_104731
Residue:
592
  
Component 7
Name:
Protein kinase C epsilon type
Synonyms:
KPCE_RAT Prkce Protein kinase C epsilon nPKC-epsilon
Type:
PROTEIN
Mol. Mass.:
83483.06
Organism:
Rattus norvegicus
Description:
ChEMBL_160964
Residue:
737
  
Component 8
Name:
Protein kinase C beta type
Synonyms:
KPCB_RAT Pkcb Prkcb1 Protein kinase C (PKC) | Protein kinase C beta
Type:
Enzyme Mixture
Mol. Mass.:
76755.54
Organism:
Rattus norvegicus (rat)
Description:
PKC from rat brain is known to contain predominately the conventional PKC isoforms, alpha, beta I, beta II, gamma.
Residue:
671
  
Inhibitor
Name:
BDBM50108293
Synonyms:
CHEMBL277817 | Indolocarbazole analogue
Type:
Small organic molecule
Emp. Form.:
C33H33N3O7
Mol. Mass.:
583.631
SMILES:
CCOCc1ccc2n3[C@H]4C[C@](O)(C(=O)OC)[C@](C)(O4)n4c5ccc(COCC)cc5c5c6CNC(=O)c6c(c2c1)c3c45
: