Target
Integrin alpha-4/beta-7
Ligand
BDBM50108338
Substrate
Meas. Tech.
ChEMBL_217475 (CHEMBL823551)
IC50
2.8±n/a nM
Citation
 Chang, LLTruong, QMumford, RAEgger, LAKidambi, ULyons, KMcCauley, EVan Riper, GVincent, SSchmidt, JAMacCoss, MHagmann, WK The discovery of small molecule carbamates as potent dual alpha(4)beta(1)/alpha(4)beta(7) integrin antagonists. Bioorg Med Chem Lett 12:159-63 (2001)  
Target
Name:
Integrin alpha-4/beta-7
Synonyms:
Integrin α4β7 Integrin alpha-4/beta7 | Integrin alpha4beta7
Type:
Protein Complex
Mol. Mass.:
Description:
The assay uses stably transfected K562 cells expressing human alpha4beta7 integrin.
Components:
This complex has 2 components.
Component 1
Name:
Integrin alpha-4
Synonyms:
CD49 antigen-like family member D CD49d antigen ITA4_HUMAN Integrin alpha-4 Integrin alpha-IV VLA-4 integrin alpha 4 precursor | integrin alpha-4 precursor
Type:
Membrane Protein
Mol. Mass.:
114897.35
Organism:
Homo sapiens (Human)
Description:
P13612
Residue:
1032
  
Component 2
Name:
Integrin beta-7
Synonyms:
ITB7_HUMAN Integrin alpha-4/beta-7 Integrin beta7
Type:
Membrane Protein
Mol. Mass.:
86893.88
Organism:
Homo sapiens (Human)
Description:
P26010
Residue:
798
  
Inhibitor
Name:
BDBM50108338
Synonyms:
CHEMBL288474 | Pyrrolidine-1-carboxylic acid 4-{(S)-2-[((S)-1-benzenesulfonyl-pyrrolidine-2-carbonyl)-amino]-2-carboxy-ethyl}-phenyl ester
Type:
Small organic molecule
Emp. Form.:
C25H29N3O7S
Mol. Mass.:
515.579
SMILES:
OC(=O)[C@H](Cc1ccc(OC(=O)N2CCCC2)cc1)NC(=O)[C@@H]1CCCN1S(=O)(=O)c1ccccc1
: