Target
5-hydroxytryptamine receptor 1A
Ligand
BDBM50108659
Substrate
Meas. Tech.
ChEMBL_1564 (CHEMBL616351)
IC50
>1000±n/a nM
Citation
 Maier, CAWünsch, B Novel spiropiperidines as highly potent and subtype selective sigma-receptor ligands. Part 1. J Med Chem 45:438-48 (2002)  
Target
Name:
5-hydroxytryptamine receptor 1A
Synonyms:
5-HT1A 5-hydroxytryptamine receptor 1A (5HT1A) Gpcr18 Serotonin 1a (5-HT1a) receptor
Type:
Enzyme
Mol. Mass.:
46192.09
Organism:
Mus musculus (Mouse)
Description:
Q64264
Residue:
421
  
Inhibitor
Name:
BDBM50108659
Synonyms:
1'-benzyl-3-methoxy-3H-spiro[2-benzofuran-1,4'-piperidine] 1'-benzyl-3-methoxyspiro[1,3-dihydroisobenzofuran-1,4'-(hexahydropyridine)] | CHEMBL138809
Type:
Small organic molecule
Emp. Form.:
C20H23NO2
Mol. Mass.:
309.4021
SMILES:
COC1OC2(CCN(Cc3ccccc3)CC2)c2ccccc12
: