Target
Glycine receptor subunit alpha-4
Ligand
BDBM50108654
Substrate
Meas. Tech.
ChEMBL_70971 (CHEMBL857373)
IC50
>10000±n/a nM
Citation
 Maier, CAWünsch, B Novel spiropiperidines as highly potent and subtype selective sigma-receptor ligands. Part 1. J Med Chem 45:438-48 (2002)  
Target
Name:
Glycine receptor subunit alpha-4
Synonyms:
GLRA4_MOUSE Glycine receptor alpha-4 chain
Type:
PROTEIN
Mol. Mass.:
52521.54
Organism:
Mus musculus
Description:
ChEMBL_70971
Residue:
456
  
Inhibitor
Name:
BDBM50108654
Synonyms:
1-[3-methoxyspiro[3,4-dihydro-1H-isochromene-1,4'-(hexahydropyridine)]-1-yl]-3-phenylpropane | CHEMBL138458
Type:
Small organic molecule
Emp. Form.:
C23H29NO2
Mol. Mass.:
351.4819
SMILES:
COC1Cc2ccccc2C2(CCN(CCCc3ccccc3)CC2)O1
: