Target
Motilin receptor
Ligand
BDBM50108829
Substrate
Meas. Tech.
ChEMBL_122666 (CHEMBL732796)
IC50
33±n/a nM
Citation
 Haramura, MOkamachi, ATsuzuki, KYogo, KIkuta, MKozono, TTakanashi, HMurayama, E Design and synthesis of motilin antagonists derived from the [1-4] fragment of porcine motilin. J Med Chem 45:670-5 (2002)  
Target
Name:
Motilin receptor
Synonyms:
Type:
Mol. Mass.:
43771.25
Organism:
Oryctolagus cuniculus
Description:
Residue:
400
  
Inhibitor
Name:
BDBM50108829
Synonyms:
2-Amino-N-[2-(3-tert-butyl-4-hydroxy-benzyl)-3,8,15-trioxo-1,4,9triaza-cyclopentadec-14-yl]-3-phenyl-propionamide | CHEMBL348744
Type:
Small organic molecule
Emp. Form.:
C32H45N5O5
Mol. Mass.:
579.7302
SMILES:
CC(C)(C)c1cc(CC2NC(=O)C(CCCCNC(=O)CCCNC2=O)NC(=O)C(N)Cc2ccccc2)ccc1O
: