Target
Sodium-dependent serotonin transporter
Ligand
BDBM50109058
Substrate
Meas. Tech.
ChEBML_201366
Ki
41±n/a nM
Citation
 Mewshaw, REMeagher, KLZhou, PZhou, DShi, XScerni, RSmith, DSchechter, LEAndree, TH Studies toward the discovery of the next generation of antidepressants. Part 2: incorporating a 5-HT(1A) antagonist component into a class of serotonin reuptake inhibitors. Bioorg Med Chem Lett 12:307-10 (2002)  
Target
Name:
Sodium-dependent serotonin transporter
Synonyms:
5-HT Transporter 5HTT SC6A4_HUMAN SLC6A4 Serotonin transporter (5HTT) Sodium-dependent serotonin transporter (SERT) | Solute carrier family 6 member 4
Type:
Multi-pass membrane protein
Mol. Mass.:
70322.51
Organism:
Homo sapiens (Human)
Description:
P31645
Residue:
630
  
Inhibitor
Name:
BDBM50109058
Synonyms:
1H-4-indolyl 2-[4-(1H-3-indolyl)-1,2,3,6-tetrahydro-1-pyridinyl]ethyl ether | CHEMBL421027
Type:
Small organic molecule
Emp. Form.:
C23H23N3O
Mol. Mass.:
357.4482
SMILES:
C(CN1CCC(=CC1)c1c[nH]c2ccccc12)Oc1cccc2[nH]ccc12
: