Target
Sodium-dependent serotonin transporter
Ligand
BDBM50109054
Substrate
Meas. Tech.
ChEBML_201809
Ki
1.2±n/a nM
Citation
 Mewshaw, REMeagher, KLZhou, PZhou, DShi, XScerni, RSmith, DSchechter, LEAndree, TH Studies toward the discovery of the next generation of antidepressants. Part 2: incorporating a 5-HT(1A) antagonist component into a class of serotonin reuptake inhibitors. Bioorg Med Chem Lett 12:307-10 (2002)  
Target
Name:
Sodium-dependent serotonin transporter
Synonyms:
5-HT Transporter 5HT transporter Anandamid membrane transporter, AMT Monoamine transporters; Norepinephrine & serotonin Slc6a4 Sodium-dependent serotonin transporter (SERT) | imipramine receptor
Type:
Multi-pass membrane protein
Mol. Mass.:
70168.43
Organism:
Rattus norvegicus (rat)
Description:
P31652
Residue:
630
  
Inhibitor
Name:
BDBM50109054
Synonyms:
3-{1-[2-(2,3-Dihydro-benzo[1,4]dioxin-5-yloxy)-ethyl]-1,2,3,6-tetrahydro-pyridin-4-yl}-5-fluoro-1H-indole | CHEMBL105390
Type:
Small organic molecule
Emp. Form.:
C23H23FN2O3
Mol. Mass.:
394.4387
SMILES:
Fc1ccc2[nH]cc(C3=CCN(CCOc4cccc5OCCOc45)CC3)c2c1
: