Target
Carboxypeptidase A1
Ligand
BDBM50109599
Substrate
Meas. Tech.
ChEMBL_45617 (CHEMBL655428)
Ki
270±n/a nM
Citation
 Park, JDKim, DH Cysteine derivatives as inhibitors for carboxypeptidase A: synthesis and structure-activity relationships. J Med Chem 45:911-8 (2002)  
Target
Name:
Carboxypeptidase A1
Synonyms:
CBPA1_BOVIN CPA1 Carboxypeptidase A (CPA) | Carboxypeptidase A1 precursor
Type:
Enzyme
Mol. Mass.:
47073.90
Organism:
Bos taurus (bovine)
Description:
From Sigma-Aldrich Co.
Residue:
419
  
Inhibitor
Name:
BDBM50109599
Synonyms:
2-Benzylamino-3-mercapto-propionic acid | CHEMBL169182
Type:
Small organic molecule
Emp. Form.:
C10H13NO2S
Mol. Mass.:
211.281
SMILES:
OC(=O)C(CS)NCc1ccccc1
: