Target
Prostaglandin G/H synthase 1
Ligand
BDBM50109676
Substrate
Meas. Tech.
ChEBML_159403
IC50
50±n/a nM
Citation
 Kalgutkar, ASRowlinson, SWCrews, BCMarnett, LJ Amide derivatives of meclofenamic acid as selective cyclooxygenase-2 inhibitors. Bioorg Med Chem Lett 12:521-4 (2002)  
Target
Name:
Prostaglandin G/H synthase 1
Synonyms:
COX1 Cyclooxygenase-1 (COX-1) PTGS1 | Prostaglandin G/H synthase (cyclooxygenase)
Type:
Protein
Mol. Mass.:
68868.60
Organism:
Ovis aries (Sheep)
Description:
Residue:
600
  
Inhibitor
Name:
BDBM50109676
Synonyms:
2-(2,6-Dichloro-3-methyl-phenylamino)-N-octyl-benzamide | CHEMBL148931
Type:
Small organic molecule
Emp. Form.:
C22H28Cl2N2O
Mol. Mass.:
407.377
SMILES:
CCCCCCCCNC(=O)c1ccccc1Nc1c(Cl)ccc(C)c1Cl
: