Target
Gag-Pol polyprotein [489-587]
Ligand
BDBM517
Substrate
Meas. Tech.
ChEMBL_79961 (CHEMBL687732)
IC50
0.590000±n/a nM
Citation
 Cheng, YRano, TAHuening, TTZhang, FLu, ZSchleif, WAGabryelski, LOlsen, DBStahlhut, MKuo, LCLin, JHXu, XJin, LOlah, TVMcLoughlin, DAKing, RCChapman, KTTata, JR A combinatorial library of indinavir analogues and its in vitro and in vivo studies. Bioorg Med Chem Lett 12:529-32 (2002)  
Target
Name:
Gag-Pol polyprotein [489-587]
Synonyms:
Human immunodeficiency virus type 1 protease Pol polyprotein | gag-pol
Type:
Enzyme Subunit
Mol. Mass.:
10781.16
Organism:
Human immunodeficiency virus type 1
Description:
P04585[489-587]
Residue:
99
  
Inhibitor
Name:
BDBM517
Synonyms:
(2S)-1-[(2S,4R)-4-benzyl-2-hydroxy-4-{[(1S,2R)-2-hydroxy-2,3-dihydro-1H-inden-1-yl]carbamoyl}butyl]-N-tert-butyl-4-(pyridin-3-ylmethyl)piperazine-2-carboxamide Crixivan Indinavir L-735, 524 | MK639
Type:
Small organic molecule
Emp. Form.:
C36H47N5O4
Mol. Mass.:
613.7895
SMILES:
CC(C)(C)NC(=O)[C@@H]1CN(Cc2cccnc2)CCN1C[C@@H](O)C[C@@H](Cc1ccccc1)C(=O)N[C@@H]1[C@H](O)Cc2ccccc12
: