Target
Neutrophil elastase
Ligand
BDBM50109771
Substrate
Meas. Tech.
ChEBML_144794
IC50
3.5±n/a nM
Citation
 Sato, FInoue, YOmodani, TImano, KOkazaki, HTakemura, TKomiya, M Design and synthesis of peptide-based carboxylic acid-containing transition-state inhibitors of human neutrophil elastase. Bioorg Med Chem Lett 12:551-5 (2002)  
Target
Name:
Neutrophil elastase
Synonyms:
Bone marrow serine protease Coagulation factor X ELANE Elastase HLE Leukocyte elastase Medullasin Neutrophil elastase (HNE) PMN elastase Trypsin
Type:
Enzyme
Mol. Mass.:
28532.38
Organism:
Homo sapiens (Human)
Description:
P08246
Residue:
267
  
Inhibitor
Name:
BDBM50109771
Synonyms:
3-{4-[(1-{2-[1-(Benzooxazole-2-carbonyl)-2-methyl-propylcarbamoyl]-pyrrolidine-1-carbonyl}-2-methyl-propylcarbamoyl)-methoxy]-phenylsulfanyl}-2,2-dimethyl-propionic acid | CHEMBL152817
Type:
Small organic molecule
Emp. Form.:
C35H44N4O8S
Mol. Mass.:
680.811
SMILES:
CC(C)[C@H](NC(=O)COc1ccc(SCC(C)(C)C(O)=O)cc1)C(=O)N1CCC[C@H]1C(=O)N[C@@H](C(C)C)C(=O)c1nc2ccccc2o1
: