Target
Multidrug resistance-associated protein 1
Ligand
BDBM50109785
Substrate
Meas. Tech.
ChEBML_43631
IC50
4500±n/a nM
Citation
 Wang, SRyder, HPretswell, IDepledge, PMilton, JHancox, TCDale, IDangerfield, WCharlton, PFaint, RDodd, RHassan, S Studies on quinazolinones as dual inhibitors of Pgp and MRP1 in multidrug resistance. Bioorg Med Chem Lett 12:571-4 (2002)  
Target
Name:
Multidrug resistance-associated protein 1
Synonyms:
7.6.2.2 ABCC1 ATP-binding cassette, sub-family C, member 1 isoform 1 LTC4 transporter MRP MRP1_HUMAN
Type:
Mol. Mass.:
171597.72
Organism:
Homo sapiens (Human)
Description:
P33527
Residue:
1531
  
Inhibitor
Name:
BDBM50109785
Synonyms:
3-[2-(6,7-Dimethoxy-3,4-dihydro-1H-isoquinolin-2-yl)-ethyl]-2-(3-dimethylamino-phenyl)-3H-quinazolin-4-one | CHEMBL433715
Type:
Small organic molecule
Emp. Form.:
C29H32N4O3
Mol. Mass.:
484.5894
SMILES:
COc1cc2CCN(CCn3c(nc4ccccc4c3=O)-c3cccc(c3)N(C)C)Cc2cc1OC
: