Target
ATP-dependent translocase ABCB1
Ligand
BDBM50109784
Substrate
Meas. Tech.
ChEBML_64945
IC50
4200±n/a nM
Citation
 Wang, SRyder, HPretswell, IDepledge, PMilton, JHancox, TCDale, IDangerfield, WCharlton, PFaint, RDodd, RHassan, S Studies on quinazolinones as dual inhibitors of Pgp and MRP1 in multidrug resistance. Bioorg Med Chem Lett 12:571-4 (2002)  
Target
Name:
ATP-dependent translocase ABCB1
Synonyms:
ATP-binding cassette sub-family B member 1 Abcb1b MDR1B_MOUSE Mdr1b P-glycoprotein 1 Pgy1 | Pgy1-1
Type:
PROTEIN
Mol. Mass.:
141009.67
Organism:
Mus musculus
Description:
ChEMBL_474396
Residue:
1276
  
Inhibitor
Name:
BDBM50109784
Synonyms:
2-(4-Dimethylamino-phenyl)-3-{2-[4-(3,4,5-trimethoxy-benzoyl)-piperazin-1-yl]-ethyl}-3H-quinazolin-4-one | CHEMBL356477
Type:
Small organic molecule
Emp. Form.:
C32H37N5O5
Mol. Mass.:
571.6667
SMILES:
COc1cc(cc(OC)c1OC)C(=O)N1CCN(CCn2c(nc3ccccc3c2=O)-c2ccc(cc2)N(C)C)CC1
: