Target
Interstitial collagenase
Ligand
BDBM50291702
Substrate
Meas. Tech.
ChEMBL_106278 (CHEMBL714628)
Ki
6±n/a nM
Citation
 Sawa, MKondo, HNishimura, S Encounter with unexpected collagenase-1 selective inhibitor: switchover of inhibitor binding pocket induced by fluorine atom. Bioorg Med Chem Lett 12:581-4 (2002)  
Target
Name:
Interstitial collagenase
Synonyms:
CLG MMP1 Matrix metalloproteinase-1 | Matrix metalloproteinase-1 (MMP-1)
Type:
Enzyme
Mol. Mass.:
54010.26
Organism:
Homo sapiens (Human)
Description:
P03956
Residue:
469
  
Inhibitor
Name:
BDBM50291702
Synonyms:
(3-Hydroxycarbamoyl-3,4-dihydro-1H-isoquinolin-2-yl)-(4-methoxy-phenyl)-phosphinic acid 2,2-difluoro-ethyl ester CHEMBL435462
Type:
Small organic molecule
Emp. Form.:
C19H21F2N2O5P
Mol. Mass.:
426.351
SMILES:
COc1ccc(cc1)[P@](=O)(OCC(F)F)N1Cc2ccccc2C[C@@H]1C(=O)NO
: