Target
Matrix metalloproteinase-9
Ligand
BDBM50291702
Substrate
Meas. Tech.
ChEMBL_105400 (CHEMBL710819)
Ki
5±n/a nM
Citation
 Sawa, MKondo, HNishimura, S Encounter with unexpected collagenase-1 selective inhibitor: switchover of inhibitor binding pocket induced by fluorine atom. Bioorg Med Chem Lett 12:581-4 (2002)  
Target
Name:
Matrix metalloproteinase-9
Synonyms:
67 kDa matrix metalloproteinase-9 92 kDa gelatinase CLG4B Gelatinase B MMP9 Matrix metalloproteinase 9 (MMP-9) Matrix metalloproteinase-9 (MMP9)
Type:
Enzyme
Mol. Mass.:
78452.28
Organism:
Homo sapiens (Human)
Description:
P14780
Residue:
707
  
Inhibitor
Name:
BDBM50291702
Synonyms:
(3-Hydroxycarbamoyl-3,4-dihydro-1H-isoquinolin-2-yl)-(4-methoxy-phenyl)-phosphinic acid 2,2-difluoro-ethyl ester CHEMBL435462
Type:
Small organic molecule
Emp. Form.:
C19H21F2N2O5P
Mol. Mass.:
426.351
SMILES:
COc1ccc(cc1)[P@](=O)(OCC(F)F)N1Cc2ccccc2C[C@@H]1C(=O)NO
: