Target
Integrin alpha-V/beta-6
Ligand
BDBM50110234
Substrate
Meas. Tech.
ChEMBL_217966 (CHEMBL824085)
IC50
900±n/a nM
Citation
 Goodman, SLHölzemann, GSulyok, GAKessler, H Nanomolar small molecule inhibitors for alphav(beta)6, alphav(beta)5, and alphav(beta)3 integrins. J Med Chem 45:1045-51 (2002)  
Target
Name:
Integrin alpha-V/beta-6
Synonyms:
ITGAV/ITGB6 Integrin alpha-v/beata-6 Integrin beta-6/Vitronectin receptor alpha
Type:
Enzyme
Mol. Mass.:
Description:
Components:
This complex has 2 components.
Component 1
Name:
Integrin alpha-V
Synonyms:
ITAV_HUMAN Integrin alpha-V/alpha-5 VNRA Vitronectin receptor | Vitronectin receptor subunit alpha
Type:
PROTEIN
Mol. Mass.:
116024.92
Organism:
Homo sapiens (Human)
Description:
ChEMBL_582336
Residue:
1048
  
Component 2
Name:
Integrin beta-6
Synonyms:
ITB6_HUMAN | ITGB6
Type:
PROTEIN
Mol. Mass.:
85919.61
Organism:
Homo sapiens (Human)
Description:
EBI_10916
Residue:
788
  
Inhibitor
Name:
BDBM50110234
Synonyms:
CHEMBL9522 | [8-Benzyl-14-(3-guanidino-propyl)-11-isopropyl-10-methyl-3,6,9,12,15-pentaoxo-1,2,4,7,10,13hexaaza-cyclopentadec-5-yl]-acetic acid
Type:
Small organic molecule
Emp. Form.:
C26H39N9O7
Mol. Mass.:
589.644
SMILES:
CC(C)C1N(C)C(=O)[C@@H](Cc2ccccc2)NC(=O)C(CC(O)=O)NC(=O)NNC(=O)C(CCCNC(N)=N)NC1=O
: