Target
Integrin alpha-V/beta-6
Ligand
BDBM50110232
Substrate
Meas. Tech.
ChEMBL_217966 (CHEMBL824085)
IC50
0.6±n/a nM
Citation
 Goodman, SLHölzemann, GSulyok, GAKessler, H Nanomolar small molecule inhibitors for alphav(beta)6, alphav(beta)5, and alphav(beta)3 integrins. J Med Chem 45:1045-51 (2002)  
Target
Name:
Integrin alpha-V/beta-6
Synonyms:
ITGAV/ITGB6 Integrin alpha-v/beata-6 Integrin beta-6/Vitronectin receptor alpha
Type:
Enzyme
Mol. Mass.:
Description:
Components:
This complex has 2 components.
Component 1
Name:
Integrin alpha-V
Synonyms:
ITAV_HUMAN Integrin alpha-V/alpha-5 VNRA Vitronectin receptor | Vitronectin receptor subunit alpha
Type:
PROTEIN
Mol. Mass.:
116024.92
Organism:
Homo sapiens (Human)
Description:
ChEMBL_582336
Residue:
1048
  
Component 2
Name:
Integrin beta-6
Synonyms:
ITB6_HUMAN | ITGB6
Type:
PROTEIN
Mol. Mass.:
85919.61
Organism:
Homo sapiens (Human)
Description:
EBI_10916
Residue:
788
  
Inhibitor
Name:
BDBM50110232
Synonyms:
3-Biphenyl-4-yl-3-{2-[5-(pyridin-2-ylamino)-pentanoylamino]-acetylamino}-propionic acid | CHEMBL9555
Type:
Small organic molecule
Emp. Form.:
C27H30N4O4
Mol. Mass.:
474.5515
SMILES:
OC(=O)CC(NC(=O)CNC(=O)CCCCNc1ccccn1)c1ccc(cc1)-c1ccccc1
: