Target
Histamine N-methyltransferase
Ligand
BDBM50110307
Substrate
Meas. Tech.
ChEMBL_87238 (CHEMBL696458)
IC50
590±n/a nM
Citation
 Apelt, JLigneau, XPertz, HHArrang, JMGanellin, CRSchwartz, JCSchunack, WStark, H Development of a new class of nonimidazole histamine H(3) receptor ligands with combined inhibitory histamine N-methyltransferase activity. J Med Chem 45:1128-41 (2002)  
Target
Name:
Histamine N-methyltransferase
Synonyms:
HNMT_RAT | Hnmt
Type:
PROTEIN
Mol. Mass.:
33931.03
Organism:
Rattus norvegicus
Description:
ChEMBL_87236
Residue:
295
  
Inhibitor
Name:
BDBM50110307
Synonyms:
(3-Methyl-quinolin-4-yl)-(3-piperidin-1-yl-propyl)-amine; Oxalic acid | CHEMBL275874
Type:
Small organic molecule
Emp. Form.:
C18H25N3
Mol. Mass.:
283.4112
SMILES:
Cc1cnc2ccccc2c1NCCCN1CCCCC1
: