Target
Neuropeptide Y receptor type 5
Ligand
BDBM50110571
Substrate
Meas. Tech.
ChEBML_143991
IC50
0.540000±n/a nM
Citation
 Itani, HIto, HSakata, YHatakeyama, YOohashi, HSatoh, Y Novel potent antagonists of human neuropeptide Y Y5 receptors. Part 3: 7-methoxy-1-hydroxy-1-substituted tetraline derivatives. Bioorg Med Chem Lett 12:799-802 (2002)  
Target
Name:
Neuropeptide Y receptor type 5
Synonyms:
NPY-Y5 NPY5-R NPY5R_HUMAN NPYY5 Neuropeptide Y receptor type 5 ( NPY Y5) | Y5 receptor
Type:
Enzyme
Mol. Mass.:
50746.64
Organism:
Homo sapiens (Human)
Description:
Q15761
Residue:
445
  
Inhibitor
Name:
BDBM50110571
Synonyms:
CHEMBL167991 Naphthalene-1-sulfonic acid [2-(4-{[(1-hydroxy-7-methoxy-1,2,3,4-tetrahydro-naphthalen-1-ylmethyl)-amino]-methyl}-piperidin-1-yl)-ethyl]-amide
Type:
Small organic molecule
Emp. Form.:
C30H39N3O4S
Mol. Mass.:
537.713
SMILES:
COc1ccc2CCCC(O)(CNCC3CCN(CCNS(=O)(=O)c4cccc5ccccc45)CC3)c2c1
: