Target
Bifunctional dihydrofolate reductase-thymidylate synthase
Ligand
BDBM18790
Substrate
Meas. Tech.
ChEMBL_55401 (CHEMBL668410)
Ki
1.2±n/a nM
Citation
 Tarnchompoo, BSirichaiwat, CPhupong, WIntaraudom, CSirawaraporn, WKamchonwongpaisan, SVanichtanankul, JThebtaranonth, YYuthavong, Y Development of 2,4-diaminopyrimidines as antimalarials based on inhibition of the S108N and C59R+S108N mutants of dihydrofolate reductase from pyrimethamine-resistant Plasmodium falciparum. J Med Chem 45:1244-52 (2002)  
Target
Name:
Bifunctional dihydrofolate reductase-thymidylate synthase
Synonyms:
DHFR-TS Dihydrofolate Reductase-Thymidylate Synthase (DHFR-TS) Mutant KICB1 PfDHFR-TS double mutant (C59R+S108N)
Type:
Enzyme
Mol. Mass.:
71822.51
Organism:
Plasmodium falciparum (isolate K1 / Thailand)
Description:
The mutant clone was prepared by cassette mutagenesis using wildtype pfDHFR as a template, and expressed in E. coli.
Residue:
608
  
Inhibitor
Name:
BDBM18790
Synonyms:
6-hexyl-5-phenylpyrimidine-2,4-diamine P39
Type:
Small organic molecule
Emp. Form.:
C16H22N4
Mol. Mass.:
270.3727
SMILES:
CCCCCCc1nc(N)nc(N)c1-c1ccccc1
: