Target
Cytosolic phospholipase A2 beta
Ligand
BDBM50110868
Substrate
Meas. Tech.
ChEMBL_156209 (CHEMBL767151)
IC50
1200±n/a nM
Citation
 Connolly, SBennion, CBotterell, SCroshaw, PJHallam, CHardy, KHartopp, PJackson, CGKing, SJLawrence, LMete, AMurray, DRobinson, DHSmith, GMStein, LWalters, IWells, EWithnall, WJ Design and synthesis of a novel and potent series of inhibitors of cytosolic phospholipase A(2) based on a 1,3-disubstituted propan-2-one skeleton. J Med Chem 45:1348-62 (2002)  
Target
Name:
Cytosolic phospholipase A2 beta
Synonyms:
Cytosolic phospholipase A2 beta PLA2G4B Phospholipase A2 group IVB | cPLA2-beta
Type:
PROTEIN
Mol. Mass.:
87967.69
Organism:
Homo sapiens (Human)
Description:
ChEMBL_156210
Residue:
781
  
Inhibitor
Name:
BDBM50110868
Synonyms:
4-{3-Oxo-4-[4-(5-phenyl-pentylsulfanyl)-phenoxy]-butyl}-benzoic acid | CHEMBL442099
Type:
Small organic molecule
Emp. Form.:
C28H30O4S
Mol. Mass.:
462.6
SMILES:
OC(=O)c1ccc(CCC(=O)COc2ccc(SCCCCCc3ccccc3)cc2)cc1
: