Target
Cytosolic phospholipase A2 beta
Ligand
BDBM50110850
Substrate
Meas. Tech.
ChEMBL_156210 (CHEMBL767152)
IC50
3300±n/a nM
Citation
 Connolly, SBennion, CBotterell, SCroshaw, PJHallam, CHardy, KHartopp, PJackson, CGKing, SJLawrence, LMete, AMurray, DRobinson, DHSmith, GMStein, LWalters, IWells, EWithnall, WJ Design and synthesis of a novel and potent series of inhibitors of cytosolic phospholipase A(2) based on a 1,3-disubstituted propan-2-one skeleton. J Med Chem 45:1348-62 (2002)  
Target
Name:
Cytosolic phospholipase A2 beta
Synonyms:
Cytosolic phospholipase A2 beta PLA2G4B Phospholipase A2 group IVB | cPLA2-beta
Type:
PROTEIN
Mol. Mass.:
87967.69
Organism:
Homo sapiens (Human)
Description:
ChEMBL_156210
Residue:
781
  
Inhibitor
Name:
BDBM50110850
Synonyms:
CHEMBL281320 | {3-[3-(4-Decyloxy-benzyloxy)-2-oxo-propoxy]-phenyl}-acetic acid
Type:
Small organic molecule
Emp. Form.:
C28H38O6
Mol. Mass.:
470.5977
SMILES:
CCCCCCCCCCOc1ccc(COCC(=O)COc2cccc(CC(O)=O)c2)cc1
: