Target
Cannabinoid receptor 1
Ligand
BDBM50110939
Substrate
Meas. Tech.
ChEMBL_46812 (CHEMBL659698)
Ki
25±n/a nM
Citation
 Shim, JYWelsh, WJCartier, EEdwards, JLHowlett, AC Molecular interaction of the antagonist N-(piperidin-1-yl)-5-(4-chlorophenyl)-1- (2,4-dichlorophenyl)-4-methyl-1H-pyrazole-3-carboxamide with the CB1 cannabinoid receptor. J Med Chem 45:1447-59 (2002)  
Target
Name:
Cannabinoid receptor 1
Synonyms:
Brain-type cannabinoid receptor CB-R CNR1_RAT Cannabinoid receptor Cnr1 | Skr6
Type:
G Protein-Coupled Receptor (GPCR)
Mol. Mass.:
52856.55
Organism:
Rattus norvegicus (rat)
Description:
P20272
Residue:
473
  
Inhibitor
Name:
BDBM50110939
Synonyms:
1-[5-(4-Chloro-phenyl)-1-(2,4-dichloro-phenyl)-4-methyl-1H-pyrazol-3-yl]-hexan-1-one | CHEMBL287609
Type:
Small organic molecule
Emp. Form.:
C22H21Cl3N2O
Mol. Mass.:
435.774
SMILES:
CCCCCC(=O)c1nn(c(c1C)-c1ccc(Cl)cc1)-c1ccc(Cl)cc1Cl
: