Target
Adenosine receptor A2b
Ligand
BDBM50110977
Substrate
Meas. Tech.
ChEMBL_30604 (CHEMBL642011)
Ki
1.2±n/a nM
Citation
 Hayallah, AMSandoval-Ramírez, JReith, USchobert, UPreiss, BSchumacher, BDaly, JWMüller, CE 1,8-disubstituted xanthine derivatives: synthesis of potent A2B-selective adenosine receptor antagonists. J Med Chem 45:1500-10 (2002)  
Target
Name:
Adenosine receptor A2b
Synonyms:
AA2BR_HUMAN ADORA2B Adenosine receptors A2b | Adenosine receptors; A2a & A2b
Type:
G Protein-Coupled Receptor (GPCR)
Mol. Mass.:
36341.22
Organism:
Homo sapiens (Human)
Description:
Residue:
332
  
Inhibitor
Name:
BDBM50110977
Synonyms:
1-Butyl-8-(4-{2-[4-(2-methoxy-phenyl)-piperazin-1-yl]-2-oxo-ethoxy}-phenyl)-3,7-dihydro-purine-2,6-dione | CHEMBL37726
Type:
Small organic molecule
Emp. Form.:
C28H32N6O5
Mol. Mass.:
532.5909
SMILES:
CCCCn1c(=O)[nH]c2nc([nH]c2c1=O)-c1ccc(OCC(=O)N2CCN(CC2)c2ccccc2OC)cc1
: