Target
Melanocyte-stimulating hormone receptor
Ligand
BDBM50111161
Substrate
Meas. Tech.
ChEBML_105844
Ki
32000±n/a nM
Citation
 Mutulis, FMutule, ILapins, MWikberg, JE Reductive amination products containing naphthalene and indole moieties bind to melanocortin receptors. Bioorg Med Chem Lett 12:1035-8 (2002)  
Target
Name:
Melanocyte-stimulating hormone receptor
Synonyms:
MC1-R MSH-R MSHR_HUMAN Melanocortin receptor (M1 and M4) Melanocortin receptor 1 (MC1-R) | Melanocortin receptor 1 (MC1R)
Type:
Enzyme
Mol. Mass.:
34717.23
Organism:
Homo sapiens (Human)
Description:
Q01726
Residue:
317
  
Inhibitor
Name:
BDBM50111161
Synonyms:
CHEMBL269653 | [2-(1H-Indol-3-yl)-ethyl]-(1H-indol-3-ylmethyl)-amine
Type:
Small organic molecule
Emp. Form.:
C19H19N3
Mol. Mass.:
289.3743
SMILES:
C(Cc1c[nH]c2ccccc12)NCc1c[nH]c2ccccc12
: