Target
Melanocyte-stimulating hormone receptor
Ligand
BDBM50111154
Substrate
Meas. Tech.
ChEBML_105844
Ki
>1000000±n/a nM
Citation
 Mutulis, FMutule, ILapins, MWikberg, JE Reductive amination products containing naphthalene and indole moieties bind to melanocortin receptors. Bioorg Med Chem Lett 12:1035-8 (2002)  
Target
Name:
Melanocyte-stimulating hormone receptor
Synonyms:
MC1-R MSH-R MSHR_HUMAN Melanocortin receptor (M1 and M4) Melanocortin receptor 1 (MC1-R) | Melanocortin receptor 1 (MC1R)
Type:
Enzyme
Mol. Mass.:
34717.23
Organism:
Homo sapiens (Human)
Description:
Q01726
Residue:
317
  
Inhibitor
Name:
BDBM50111154
Synonyms:
CHEMBL8201 | N*1*-Naphthalen-2-ylmethyl-propane-1,3-diamine
Type:
Small organic molecule
Emp. Form.:
C14H18N2
Mol. Mass.:
214.3061
SMILES:
NCCCNCc1ccc2ccccc2c1
: