Target
Melanocyte-stimulating hormone receptor
Ligand
BDBM50111167
Substrate
Meas. Tech.
ChEMBL_105844 (CHEMBL716054)
Ki
690±n/a nM
Citation
 Mutulis, FMutule, ILapins, MWikberg, JE Reductive amination products containing naphthalene and indole moieties bind to melanocortin receptors. Bioorg Med Chem Lett 12:1035-8 (2002)  
Target
Name:
Melanocyte-stimulating hormone receptor
Synonyms:
MC1-R MSH-R MSHR_HUMAN Melanocortin receptor (M1 and M4) Melanocortin receptor 1 (MC1-R) | Melanocortin receptor 1 (MC1R)
Type:
Enzyme
Mol. Mass.:
34717.23
Organism:
Homo sapiens (Human)
Description:
Q01726
Residue:
317
  
Inhibitor
Name:
BDBM50111167
Synonyms:
2-Amino-5-guanidino-pentanoic acid naphthalen-1-ylmethyl-naphthalen-2-ylmethyl-amide CHEMBL267020
Type:
Small organic molecule
Emp. Form.:
C28H31N5O
Mol. Mass.:
453.5786
SMILES:
N[C@@H](CCCNC(N)=N)C(=O)N(Cc1ccc2ccccc2c1)Cc1cccc2ccccc12
: