Target
Melanocyte-stimulating hormone receptor
Ligand
BDBM50111166
Substrate
Meas. Tech.
ChEBML_105844
Ki
>1000000±n/a nM
Citation
 Mutulis, FMutule, ILapins, MWikberg, JE Reductive amination products containing naphthalene and indole moieties bind to melanocortin receptors. Bioorg Med Chem Lett 12:1035-8 (2002)  
Target
Name:
Melanocyte-stimulating hormone receptor
Synonyms:
MC1-R MSH-R MSHR_HUMAN Melanocortin receptor (M1 and M4) Melanocortin receptor 1 (MC1-R) | Melanocortin receptor 1 (MC1R)
Type:
Enzyme
Mol. Mass.:
34717.23
Organism:
Homo sapiens (Human)
Description:
Q01726
Residue:
317
  
Inhibitor
Name:
BDBM50111166
Synonyms:
1-Naphthalen-2-ylmethyl-piperazine | CHEMBL8756
Type:
Small organic molecule
Emp. Form.:
C15H18N2
Mol. Mass.:
226.3168
SMILES:
C(N1CCNCC1)c1ccc2ccccc2c1
: