Target
Integrin alpha-4/beta-1
Ligand
BDBM50111257
Substrate
Meas. Tech.
ChEMBL_213544 (CHEMBL816991)
IC50
3.7±n/a nM
Citation
 Porter, JRArchibald, SCChilds, KCritchley, DHead, JCLinsley, JMParton, TARobinson, MKShock, ATaylor, RJWarrellow, GJAlexander, RPLangham, B Squaric acid derivatives as VLA-4 integrin antagonists. Bioorg Med Chem Lett 12:1051-4 (2002)  
Target
Name:
Integrin alpha-4/beta-1
Synonyms:
Fibronectin receptor beta/Integrin alpha-4 | Integrin alpha-4/beta-1
Type:
Mol. Mass.:
Description:
ASSAY_ID of EBI is 88912
Components:
This complex has 2 components.
Component 1
Name:
Integrin beta-1
Synonyms:
CD_antigen=CD29 Fibronectin receptor beta GPIIA ITGB1 MDF2 | MSK12
Type:
Enzyme
Mol. Mass.:
88400.38
Organism:
Homo sapiens (Human)
Description:
P05556
Residue:
798
  
Component 2
Name:
Integrin alpha-4
Synonyms:
CD49 antigen-like family member D CD49d antigen ITA4_HUMAN Integrin alpha-4 Integrin alpha-IV VLA-4 integrin alpha 4 precursor | integrin alpha-4 precursor
Type:
Membrane Protein
Mol. Mass.:
114897.35
Organism:
Homo sapiens (Human)
Description:
P13612
Residue:
1032
  
Inhibitor
Name:
BDBM50111257
Synonyms:
(S)-2-(2-Benzylamino-3,4-dioxo-cyclobut-1-enylamino)-3-{4-[(3,5-dichloro-pyridine-4-carbonyl)-amino]-phenyl}-propionic acid | CHEMBL10107
Type:
Small organic molecule
Emp. Form.:
C26H20Cl2N4O5
Mol. Mass.:
539.367
SMILES:
OC(=O)[C@H](Cc1ccc(NC(=O)c2c(Cl)cncc2Cl)cc1)Nc1c(NCc2ccccc2)c(=O)c1=O
: