Target
Cyclin-dependent kinase 1/G2/mitotic-specific cyclin-B1/G2/mitotic-specific cyclin-B2/G2/mitotic-specific cyclin-B3
Ligand
BDBM100152
Substrate
Meas. Tech.
ChEMBL_48868 (CHEMBL661324)
IC50
18000±n/a nM
Citation
 Song, YWang, JTeng, SFKesuma, DDeng, YDuan, JWang, JHQi, RZSim, MM Beta-carbolines as specific inhibitors of cyclin-dependent kinases. Bioorg Med Chem Lett 12:1129-32 (2002)  
Target
Name:
Cyclin-dependent kinase 1/G2/mitotic-specific cyclin-B1/G2/mitotic-specific cyclin-B2/G2/mitotic-specific cyclin-B3
Synonyms:
Cyclin B/Cyclin-Dependent Kinase 1 (CDK1)/G2/mitotic-specific cyclin B2/G2/mitotic-specific cyclin B3 Cyclin-dependent kinase 1/cyclin B
Type:
Mol. Mass.:
Description:
ASSAY_ID of EBI is 40085
Components:
This complex has 4 components.
Component 1
Name:
G2/mitotic-specific cyclin-B3
Synonyms:
CCNB3 CYCB3 G2/mitotic-specific cyclin-B3
Type:
PROTEIN
Mol. Mass.:
157916.84
Organism:
Homo sapiens (Human)
Description:
Residue:
1395
  
Component 2
Name:
G2/mitotic-specific cyclin-B1
Synonyms:
CCNB CCNB1_HUMAN
Type:
Enzyme Subunit
Mol. Mass.:
48340.95
Organism:
Homo sapiens (Human)
Description:
P14635
Residue:
433
  
Component 3
Name:
G2/mitotic-specific cyclin-B2
Synonyms:
CCNB2 Cyclin-dependent kinase 1/cyclin B | G2/mitotic-specific cyclin-B2
Type:
PROTEIN
Mol. Mass.:
45293.13
Organism:
Homo sapiens (Human)
Description:
Residue:
398
  
Component 4
Name:
Cyclin-dependent kinase 1
Synonyms:
CDC2 CDK1 CDKN1 Cell division protein kinase 1 P34CDC2 | p34 protein kinase
Type:
Enzyme Subunit
Mol. Mass.:
34101.08
Organism:
Homo sapiens (Human)
Description:
P06493
Residue:
297
  
Inhibitor
Name:
BDBM100152
Synonyms:
7-methoxy-1-methyl-9H-beta-carboline;hydrochloride HARMINE MLS002153910 cid_5359389
Type:
Small organic molecule
Emp. Form.:
C13H12N2O
Mol. Mass.:
212.2472
SMILES:
COc1ccc2c(c1)[nH]c1c(C)nccc21
: