Target
Somatostatin receptor type 2
Ligand
BDBM50111540
Substrate
Meas. Tech.
ChEMBL_200671 (CHEMBL806162)
IC50
8.4±n/a nM
Citation
 Gazal, SGelerman, GZiv, OKarpov, OLitman, PBracha, MAfargan, MGilon, C Human somatostatin receptor specificity of backbone-cyclic analogues containing novel sulfur building units. J Med Chem 45:1665-71 (2002)  
Target
Name:
Somatostatin receptor type 2
Synonyms:
SOMATOSTATIN SST2 SS-2-R SS2R SSTR2 | Somatostatin receptor type 2 (SSTR2)
Type:
Enzyme
Mol. Mass.:
41344.94
Organism:
Homo sapiens (Human)
Description:
P30874
Residue:
369
  
Inhibitor
Name:
BDBM50111540
Synonyms:
2-Amino-N-[13-(4-amino-butyl)-7,22-dibenzyl-5-carbamoylmethyl-10-(1-hydroxy-ethyl)-16,19-bis-(1H-indol-3-ylmethyl)-6,9,12,15,18,21,24-heptaoxo-1,2-dithia-5,8,11,14,17,20,23-heptaaza-cyclohexacos-25-yl]-3-phenyl-propionamide | CHEMBL406273
Type:
Small organic molecule
Emp. Form.:
C71H83N13O10S2
Mol. Mass.:
1342.63
SMILES:
C[C@@H](O)[C@@H]1NC(=O)[C@@H](CCCCN)NC(=O)[C@@H](Cc2c[nH]c3ccccc23)NC(=O)[C@@H](Cc2c[nH]c3ccccc23)NC(=O)[C@H](Cc2ccccc2)NC(=O)CN(CCSSCCN(CC(N)=O)C(=O)[C@@H](Cc2ccccc2)NC1=O)C(=O)C(N)Cc1cccc2ccccc12
: