Target
Bone morphogenetic protein 1
Ligand
BDBM50111812
Substrate
Meas. Tech.
ChEMBL_158889 (CHEMBL760877)
IC50
170±n/a nM
Citation
 Dankwardt, SMAbbot, SCBroka, CAMartin, RLChan, CSSpringman, EBVan Wart, HEWalker, KA Amino acid derived sulfonamide hydroxamates as inhibitors of procollagen C-proteinase. Part 2: Solid-phase optimization of side chains. Bioorg Med Chem Lett 12:1233-5 (2002)  
Target
Name:
Bone morphogenetic protein 1
Synonyms:
BMP-1 BMP1_HUMAN PCOLC Procollagen C-proteinase | mTld
Type:
PROTEIN
Mol. Mass.:
111254.03
Organism:
Homo sapiens (Human)
Description:
ChEMBL_518962
Residue:
986
  
Inhibitor
Name:
BDBM50111812
Synonyms:
(R)-N-Hydroxy-2-[(4-methoxy-benzenesulfonyl)-(2-pyrrol-1-yl-ethyl)-amino]-propionamide | CHEMBL21182
Type:
Small organic molecule
Emp. Form.:
C16H21N3O5S
Mol. Mass.:
367.42
SMILES:
COc1ccc(cc1)S(=O)(=O)N(CCn1cccc1)[C@H](C)C(=O)NO
: