Target
Bone morphogenetic protein 1
Ligand
BDBM50111855
Substrate
Meas. Tech.
ChEBML_158892
IC50
50±n/a nM
Citation
 Dankwardt, SMAbbot, SCBroka, CAMartin, RLChan, CSSpringman, EBVan Wart, HEWalker, KA Amino acid derived sulfonamide hydroxamates as inhibitors of procollagen C-proteinase. Part 2: Solid-phase optimization of side chains. Bioorg Med Chem Lett 12:1233-5 (2002)  
Target
Name:
Bone morphogenetic protein 1
Synonyms:
BMP-1 BMP1_HUMAN PCOLC Procollagen C-proteinase | mTld
Type:
PROTEIN
Mol. Mass.:
111254.03
Organism:
Homo sapiens (Human)
Description:
ChEMBL_518962
Residue:
986
  
Inhibitor
Name:
BDBM50111855
Synonyms:
(R)-2-[(3,4-Dimethyl-thieno[2,3-b]thiophen-2-ylmethyl)-(4-methoxy-benzenesulfonyl)-amino]-propionic acid | CHEMBL21567
Type:
Small organic molecule
Emp. Form.:
C19H21NO5S3
Mol. Mass.:
439.569
SMILES:
COc1ccc(cc1)S(=O)(=O)N(Cc1sc2scc(C)c2c1C)[C@H](C)C(O)=O
: