Target
Sodium-dependent dopamine transporter
Ligand
BDBM50111888
Substrate
Meas. Tech.
ChEBML_62179
IC50
0.380000±n/a nM
Citation
 Davies, HMRen, PKong, NXSexton, TChilders, SR Synthesis of iodinated 3beta-aryltropanes with selective binding to either the dopamine or serotonin transporters. Bioorg Med Chem Lett 12:845-7 (2002)  
Target
Name:
Sodium-dependent dopamine transporter
Synonyms:
DA transporter SC6A3_RAT Sodium-dependent dopamine transporter | Sodium-dependent dopamine transporter (DAT)
Type:
Multi-pass membrane protein
Mol. Mass.:
68749.45
Organism:
Rattus norvegicus (rat)
Description:
P23977
Residue:
619
  
Inhibitor
Name:
BDBM50111888
Synonyms:
1-[3-(3-Fluoro-4-iodo-phenyl)-8-methyl-8-aza-bicyclo[3.2.1]oct-2-yl]-propan-1-one | CHEMBL355650
Type:
Small organic molecule
Emp. Form.:
C17H21FINO
Mol. Mass.:
401.2576
SMILES:
CCC(=O)C1C2CCC(CC1c1ccc(I)c(F)c1)N2C
: