Target
Inositol 1,4,5-trisphosphate receptor type 1
Ligand
BDBM50078572
Substrate
Meas. Tech.
ChEBML_213102
Kd
1.2±n/a nM
Citation
 Nakanishi, WKikuchi, KInoue, THirose, KIino, MNagano, T Hydrophobic modifications at 1-phosphate of inositol 1,4,5-trisphosphate analogues enhance receptor binding. Bioorg Med Chem Lett 12:911-3 (2002)  
Target
Name:
Inositol 1,4,5-trisphosphate receptor type 1
Synonyms:
INSP3R1 IP3R 1 ITPR1_HUMAN Type 1 InsP3 receptor | Type 1 inositol 1,4,5-trisphosphate receptor
Type:
PROTEIN
Mol. Mass.:
313899.31
Organism:
Homo sapiens (Human)
Description:
ChEMBL_213102
Residue:
2758
  
Inhibitor
Name:
BDBM50078572
Synonyms:
CHEMBL172534 {4-[(4-Dimethylamino-phenyl)-(4-{3-[hydroxy-((1R,2R,3S,4R,5R,6S)-2,3,6-trihydroxy-4,5-bis-phosphonooxy-cyclohexyloxy)-phosphoryloxy]-propylcarbamoyl}-phenyl)-methylene]-cyclohexa-2,5-dienylidene}-dimethyl-ammonium; chloride
Type:
Small organic molecule
Emp. Form.:
C33H45N3O16P3
Mol. Mass.:
832.6416
SMILES:
CN(C)c1ccc(cc1)[C+](c1ccc(cc1)N(C)C)c1ccc(cc1)C(=O)NCCCOP(O)(=O)OC1C(O)C(O)C(OP(O)(O)=O)C(OP(O)(O)=O)C1O
: