Target
Inositol 1,4,5-trisphosphate receptor type 1
Ligand
BDBM50111932
Substrate
Meas. Tech.
ChEBML_213102
Kd
620±n/a nM
Citation
 Nakanishi, WKikuchi, KInoue, THirose, KIino, MNagano, T Hydrophobic modifications at 1-phosphate of inositol 1,4,5-trisphosphate analogues enhance receptor binding. Bioorg Med Chem Lett 12:911-3 (2002)  
Target
Name:
Inositol 1,4,5-trisphosphate receptor type 1
Synonyms:
INSP3R1 IP3R 1 ITPR1_HUMAN Type 1 InsP3 receptor | Type 1 inositol 1,4,5-trisphosphate receptor
Type:
PROTEIN
Mol. Mass.:
313899.31
Organism:
Homo sapiens (Human)
Description:
ChEMBL_213102
Residue:
2758
  
Inhibitor
Name:
BDBM50111932
Synonyms:
CHEMBL369479 | inositol 1,4,5-Trisphosphate analogue
Type:
Small organic molecule
Emp. Form.:
C34H42N3O19P3
Mol. Mass.:
889.6273
SMILES:
CN(C)c1ccc2c(-c3ccc(cc3C([O-])=O)C(=O)NCCCOP(O)(=O)O[C@@H]3[C@H](O)[C@H](O)[C@@H](OP(O)(O)=O)[C@H](OP(O)(O)=O)[C@H]3O)c3ccc(cc3oc2c1)=[N+](C)C
: