Target
Prothrombin
Ligand
BDBM50111955
Substrate
Meas. Tech.
ChEMBL_208920 (CHEMBL872723)
Ki
>4000±n/a nM
Citation
 He, WHanney, BMyers, MRCondon, SBecker, MRSpada, APBurns, CBrown, KColussi, DChu, V Benzimidazoles and isosteric compounds as potent and selective factor Xa inhibitors. Bioorg Med Chem Lett 12:919-22 (2002)  
Target
Name:
Prothrombin
Synonyms:
Activation peptide fragment 1 Coagulation factor II Prothrombin precursor Thrombin heavy chain | Thrombin light chain
Type:
Protein
Mol. Mass.:
70029.57
Organism:
Homo sapiens (Human)
Description:
P00734
Residue:
622
  
Inhibitor
Name:
BDBM50111955
Synonyms:
1-(4-Amino-quinazolin-7-ylmethyl)-4-(6-chloro-1H-benzoimidazol-2-ylmethyl)-piperazin-2-one | CHEMBL354996
Type:
Small organic molecule
Emp. Form.:
C21H20ClN7O
Mol. Mass.:
421.883
SMILES:
Nc1ncnc2cc(CN3CCN(Cc4nc5ccc(Cl)cc5[nH]4)CC3=O)ccc12
: