Target
Prothrombin
Ligand
BDBM50111957
Substrate
Meas. Tech.
ChEBML_208920
Ki
>4000±n/a nM
Citation
 He, WHanney, BMyers, MRCondon, SBecker, MRSpada, APBurns, CBrown, KColussi, DChu, V Benzimidazoles and isosteric compounds as potent and selective factor Xa inhibitors. Bioorg Med Chem Lett 12:919-22 (2002)  
Target
Name:
Prothrombin
Synonyms:
Activation peptide fragment 1 Coagulation factor II Prothrombin precursor Thrombin heavy chain | Thrombin light chain
Type:
Protein
Mol. Mass.:
70029.57
Organism:
Homo sapiens (Human)
Description:
P00734
Residue:
622
  
Inhibitor
Name:
BDBM50111957
Synonyms:
1-(4-Amino-quinazolin-7-ylmethyl)-4-(5-chloro-1H-indol-2-ylmethyl)-piperazin-2-one | CHEMBL172928
Type:
Small organic molecule
Emp. Form.:
C22H21ClN6O
Mol. Mass.:
420.895
SMILES:
Nc1ncnc2cc(CN3CCN(Cc4cc5cc(Cl)ccc5[nH]4)CC3=O)ccc12
: