Target
Histamine H3 receptor
Ligand
BDBM50112014
Substrate
Meas. Tech.
ChEBML_85849
Ki
370±n/a nM
Citation
 Aslanian, RMutahi, MWShih, NYMcCormick, KDPiwinski, JJTing, PCAlbanese, MMBerlin, MYZhu, XWong, SCRosenblum, SBJiang, YWest, RShe, SWilliams, SMBryant, MHey, JA Identification of a novel, orally bioavailable histamine H(3) receptor antagonist based on the 4-benzyl-(1H-imidazol-4-yl) template. Bioorg Med Chem Lett 12:937-41 (2002)  
Target
Name:
Histamine H3 receptor
Synonyms:
HISTAMINE H3 HRH3_CAVPO | Histamine H3 receptor
Type:
Enzyme Catalytic Domain
Mol. Mass.:
48753.61
Organism:
GUINEA PIG
Description:
HISTAMINE H3 HRH3 GUINEA PIG::Q9JI35
Residue:
445
  
Inhibitor
Name:
BDBM50112014
Synonyms:
1-(3,5-Dichloro-phenyl)-3-[4-(1H-imidazol-4-ylmethyl)-benzyl]-1,3-dimethyl-urea | CHEMBL425151
Type:
Small organic molecule
Emp. Form.:
C20H20Cl2N4O
Mol. Mass.:
403.305
SMILES:
CN(Cc1ccc(Cc2cnc[nH]2)cc1)C(=O)N(C)c1cc(Cl)cc(Cl)c1
: