Target
5-hydroxytryptamine receptor 4
Ligand
BDBM50112029
Substrate
Meas. Tech.
ChEBML_3262
IC50
6.5±n/a nM
Citation
 Harada, HYamazaki, HToyotomi, YTateishi, HMine, YYoshida, NKato, S Novel N-[1-(1-substituted 4-piperidinylmethyl)-4-piperidinyl]benzamides as potent colonic prokinetic agents. Bioorg Med Chem Lett 12:967-70 (2002)  
Target
Name:
5-hydroxytryptamine receptor 4
Synonyms:
5-HT4 5HT4R_CAVPO Serotonin 4 (5-HT4) receptor
Type:
Enzyme Catalytic Domain
Mol. Mass.:
43735.29
Organism:
GUINEA PIG
Description:
5-HT4 HTR4 GUINEA PIG::O70528
Residue:
388
  
Inhibitor
Name:
BDBM50112029
Synonyms:
4-Amino-N-{1-[1-(4-amino-butyl)-piperidin-4-ylmethyl]-piperidin-4-yl}-5-chloro-2-methoxy-benzamide | CHEMBL369037
Type:
Small organic molecule
Emp. Form.:
C23H38ClN5O2
Mol. Mass.:
452.033
SMILES:
COc1cc(N)c(Cl)cc1C(=O)NC1CCN(CC2CCN(CCCCN)CC2)CC1
: