Target
Adenosine receptor A1
Ligand
BDBM50112193
Substrate
Meas. Tech.
ChEMBL_27576 (CHEMBL643498)
Ki
137±n/a nM
Citation
 Van Calenbergh, SLink, AFujikawa, Sde Ligt, RAVanheusden, VGolisade, ABlaton, NMRozenski, JIJzerman, APHerdewijn, P 5'-Deoxy congeners of 9-(3-amido-3-deoxy-beta-D-xylofuranosyl)-N(6)-cyclopentyladenine: new adenosine A(1) receptor antagonists and inverse agonists. J Med Chem 45:1845-52 (2002)  
Target
Name:
Adenosine receptor A1
Synonyms:
A1 adenosine receptor (hA1) AA1R_HUMAN ADORA1 Adenosine A1-receptor Adenosine receptor A1 (hA1) | Adenosine transporter (AdT)
Type:
G Protein-Coupled Receptor (GPCR)
Mol. Mass.:
36520.92
Organism:
Homo sapiens (Human)
Description:
P30542
Residue:
326
  
Inhibitor
Name:
BDBM50112193
Synonyms:
CHEMBL52648 | N-[5-(6-Cyclopentylamino-purin-9-yl)-4-hydroxy-2-hydroxymethyl-tetrahydro-furan-3-yl]-3,4-dimethyl-benzamide
Type:
Small organic molecule
Emp. Form.:
C24H30N6O4
Mol. Mass.:
466.5328
SMILES:
Cc1ccc(cc1C)C(=O)N[C@H]1[C@@H](CO)O[C@H]([C@@H]1O)n1cnc2c(NC3CCCC3)ncnc12
: