Target
Ribosyldihydronicotinamide dehydrogenase [quinone]
Ligand
BDBM29611
Substrate
Meas. Tech.
ChEMBL_104942 (CHEMBL713109)
Ki
6.5±n/a nM
Citation
 Leclerc, VYous, SDelagrange, PBoutin, JARenard, PLesieur, D Synthesis of nitroindole derivatives with high affinity and selectivity for melatoninergic binding sites MT(3). J Med Chem 45:1853-9 (2002)  
Target
Name:
Ribosyldihydronicotinamide dehydrogenase [quinone]
Synonyms:
Metallothionein-3 NQO2 NRH dehydrogenase [quinone] 2 QR2 Quinone reductase 2 (NQO2) | Ribosyldihydronicotinamide dehydrogenase [quinone]
Type:
Protein
Mol. Mass.:
25917.25
Organism:
Homo sapiens (Human)
Description:
P16083
Residue:
231
  
Inhibitor
Name:
BDBM29611
Synonyms:
2-Iodomelatonin Melatonin,2-Iodo
Type:
Small organic molecule
Emp. Form.:
C13H15IN2O2
Mol. Mass.:
358.1749
SMILES:
COc1ccc2[nH]c(I)c(CCNC(C)=O)c2c1
: