Target
Transporter
Ligand
BDBM50112330
Substrate
Meas. Tech.
ChEMBL_144988 (CHEMBL754232)
Ki
1020±n/a nM
Citation
 Zou, MFAgoston, GEBelov, YKopajtic, TKatz, JLNewman, AH Enantioselective synthesis of S-(+)-2beta-carboalkoxy-3alpha-[bis(4-fluorophenyl)methoxy]tropanes as novel probes for the dopamine transporter. Bioorg Med Chem Lett 12:1249-52 (2002)  
Target
Name:
Transporter
Synonyms:
Monoamine transporters; Norepininephrine & dopamine | Norepinephrine Monoamine transporters
Type:
PROTEIN
Mol. Mass.:
66787.87
Organism:
Rattus norvegicus
Description:
ChEMBL_1463061
Residue:
597
  
Inhibitor
Name:
BDBM50112330
Synonyms:
3-[Bis-(4-fluoro-phenyl)-methoxy]-8-methyl-8-aza-bicyclo[3.2.1]octane-2-carboxylic acid ethyl ester | CHEMBL281388
Type:
Small organic molecule
Emp. Form.:
C24H27F2NO3
Mol. Mass.:
415.4729
SMILES:
CCOC(=O)C1C2CCC(CC1OC(c1ccc(F)cc1)c1ccc(F)cc1)N2C
: