Target
Transporter
Ligand
BDBM50112329
Substrate
Meas. Tech.
ChEBML_144988
Ki
269±n/a nM
Citation
 Zou, MFAgoston, GEBelov, YKopajtic, TKatz, JLNewman, AH Enantioselective synthesis of S-(+)-2beta-carboalkoxy-3alpha-[bis(4-fluorophenyl)methoxy]tropanes as novel probes for the dopamine transporter. Bioorg Med Chem Lett 12:1249-52 (2002)  
Target
Name:
Transporter
Synonyms:
Monoamine transporters; Norepininephrine & dopamine | Norepinephrine Monoamine transporters
Type:
PROTEIN
Mol. Mass.:
66787.87
Organism:
Rattus norvegicus
Description:
ChEMBL_1463061
Residue:
597
  
Inhibitor
Name:
BDBM50112329
Synonyms:
(S)-3-[Bis-(4-fluoro-phenyl)-methoxy]-8-methyl-8-aza-bicyclo[3.2.1]octane-2-carboxylic acid methyl ester CHEMBL21859
Type:
Small organic molecule
Emp. Form.:
C23H25F2NO3
Mol. Mass.:
401.4463
SMILES:
COC(=O)C1C2CCC(CC1OC(c1ccc(F)cc1)c1ccc(F)cc1)N2C
: