Target
Prothrombin
Ligand
BDBM50112496
Substrate
Meas. Tech.
ChEBML_48443
Ki
>5000±n/a nM
Citation
 Wu, SGuilford, WJChou, YLGriedel, BDLiang, ASakata, SShaw, KJTrinh, LXu, WZhao, ZMorrissey, MM Design and synthesis of aminophenol-based factor Xa inhibitors. Bioorg Med Chem Lett 12:1307-10 (2002)  
Target
Name:
Prothrombin
Synonyms:
Activation peptide fragment 1 Coagulation factor II Prothrombin precursor Thrombin heavy chain | Thrombin light chain
Type:
Protein
Mol. Mass.:
70029.57
Organism:
Homo sapiens (Human)
Description:
P00734
Residue:
622
  
Inhibitor
Name:
BDBM50112496
Synonyms:
CHEMBL26709 | N-[3-(5-Carbamimidoyl-2-hydroxy-phenyl)-allyl]-N-[4-(1-carboxymethyl-piperidin-4-yloxy)-3-trifluoromethyl-phenyl]-succinamic acid
Type:
Small organic molecule
Emp. Form.:
C28H31F3N4O7
Mol. Mass.:
592.5635
SMILES:
NC(=N)c1ccc(O)c(\C=C\CN(C(=O)CCC(O)=O)c2ccc(OC3CCN(CC(O)=O)CC3)c(c2)C(F)(F)F)c1
: