Target
Prothrombin
Ligand
BDBM50112498
Substrate
Meas. Tech.
ChEBML_48443
Ki
>5500±n/a nM
Citation
 Wu, SGuilford, WJChou, YLGriedel, BDLiang, ASakata, SShaw, KJTrinh, LXu, WZhao, ZMorrissey, MM Design and synthesis of aminophenol-based factor Xa inhibitors. Bioorg Med Chem Lett 12:1307-10 (2002)  
Target
Name:
Prothrombin
Synonyms:
Activation peptide fragment 1 Coagulation factor II Prothrombin precursor Thrombin heavy chain | Thrombin light chain
Type:
Protein
Mol. Mass.:
70029.57
Organism:
Homo sapiens (Human)
Description:
P00734
Residue:
622
  
Inhibitor
Name:
BDBM50112498
Synonyms:
CHEMBL25170 | N-[4-(1-Acetyl-piperidin-4-yloxy)-3-trifluoromethyl-phenyl]-N-[3-(5-carbamimidoyl-2-hydroxy-phenyl)-allyl]-succinamic acid
Type:
Small organic molecule
Emp. Form.:
C28H31F3N4O6
Mol. Mass.:
576.5641
SMILES:
CC(=O)N1CCC(CC1)Oc1ccc(cc1C(F)(F)F)N(C\C=C\c1cc(ccc1O)C(N)=N)C(=O)CCC(O)=O
: