Target
Prostaglandin G/H synthase 2
Ligand
BDBM50112533
Substrate
Meas. Tech.
ChEBML_159920
IC50
85.0±n/a nM
Citation
 Kozak, KRPrusakiewicz, JJRowlinson, SWMarnett, LJ Enantiospecific, selective cyclooxygenase-2 inhibitors. Bioorg Med Chem Lett 12:1315-8 (2002)  
Target
Name:
Prostaglandin G/H synthase 2
Synonyms:
COX2 Cyclooxygenase 2 (COX-2) Cyclooxygenase-2 (COX-2 AA) Cyclooxygenase-2 (COX-2) PGH2_HUMAN PHS II Prostaglandin E synthase/G/H synthase 2 Prostaglandin-endoperoxide synthase 2
Type:
Enzyme
Mol. Mass.:
69003.89
Organism:
Homo sapiens (Human)
Description:
Recombinant Cox-2 provided by Cayman (Cayman Chemical Co.,Ann Arbor, MI).
Residue:
604
  
Inhibitor
Name:
BDBM50112533
Synonyms:
2-[1-(4-Chloro-benzoyl)-5-methoxy-2-methyl-1H-indol-3-yl]-N-(1-hydroxymethyl-2-phenyl-ethyl)-acetamide | CHEMBL412307
Type:
Small organic molecule
Emp. Form.:
C28H27ClN2O4
Mol. Mass.:
490.978
SMILES:
COc1ccc2n(C(=O)c3ccc(Cl)cc3)c(C)c(CC(=O)N[C@H](CO)Cc3ccccc3)c2c1
: