Target
Gastrin-releasing peptide receptor
Ligand
BDBM50112611
Substrate
Meas. Tech.
ChEMBL_39620 (CHEMBL649928)
IC50
4.8±n/a nM
Citation
 Achilefu, SJimenez, HNDorshow, RBBugaj, JEWebb, EGWilhelm, RRRajagopalan, RJohler, JErion, JL Synthesis, in vitro receptor binding, and in vivo evaluation of fluorescein and carbocyanine peptide-based optical contrast agents. J Med Chem 45:2003-15 (2002)  
Target
Name:
Gastrin-releasing peptide receptor
Synonyms:
GRPR_RAT Gastrin-releasing peptide receptor | Grpr
Type:
Enzyme Catalytic Domain
Mol. Mass.:
43227.55
Organism:
RAT
Description:
Gastrin-Releasing peptide 0 RAT::P52500
Residue:
384
  
Inhibitor
Name:
BDBM50112611
Synonyms:
(K-G-S-G-Q-W-A-V-G-H-L-M-NH2) | CHEMBL405669
Type:
Small organic molecule
Emp. Form.:
C56H88N18O14S
Mol. Mass.:
1269.475
SMILES:
CSCCC(NC(=O)C(CC(C)C)NC(=O)C(Cc1cnc[nH]1)NC(=O)CNC(=O)C(NC(=O)C(C)NC(=O)C(Cc1c[nH]c2ccccc12)NC(=O)C(CCC(N)=O)NC(=O)CNC(=O)C(CO)NC(=O)CNC(=O)C(N)CCCCN)C(C)C)C(N)=O
: